{"text_format":"1","workbook":"xlsx","n_sheets":5,"sheets":["Summary Sheet","Tables","Grade 7","Grade 8","Grade 9"],"not_rendered":{"charts":0,"images":1,"macros":1,"external_links":0,"defined_names":8,"comments":0,"pivot_tables":0},"unopened":[],"bounds":{"document_bytes":16777216,"sheet_cells":100000,"rows_first":2000,"rows_last":500,"rows_between":2000,"halvings":0,"cell_chars":16384,"cell_head_chars":4096},"cells_cut":0,"cells_raw":0,"read":"whole","date_system":"1900"}

{"sheet":"Summary Sheet","index":0,"n_rows":16,"n_cols":14,"rows_kept":16,"cut":false,"hidden":false,"merged":[[1,2,1,6],[2,2,2,6],[4,2,4,6],[3,2,3,6]]}
[]
[null,"Name of School",null,null,null,null,null,"Please complete"]
[null,"Name of School Co-ordinator",null,null,null,null,null,"Please complete"]
[null,"Total Learners",null,null,null,null,null,"Please complete"]
[null,"Year of Olympiad",null,null,null,null,null,"Please complete"]
[]
[null,"Results Summary","Gold","Silver","Bronze","Particpation","Total"]
[null,"Grade 7",{"$f":"COUNTIF('Grade 7'!$D$3:$D$202, \"Gold\")","v":0},{"$f":"COUNTIF('Grade 7'!$D$3:$D$202, \"Silver\")","v":0},{"$f":"COUNTIF('Grade 7'!$D$3:$D$202, \"Bronze\")","v":0},{"$f":"COUNTIF('Grade 7'!$D$3:$D$202, \"Participation\")","v":0},{"$f":"SUM(C8:F8)","v":0}]
[null,"Grade 8",{"$f":"COUNTIF('Grade 8'!$D$3:$D$202, \"Gold\")","v":0},{"$f":"COUNTIF('Grade 8'!$D$3:$D$202, \"Silver\")","v":0},{"$f":"COUNTIF('Grade 8'!$D$3:$D$202, \"Bronze\")","v":0},{"$f":"COUNTIF('Grade 8'!$D$3:$D$202, \"Participation\")","v":0},{"$f":"SUM(C9:F9)","v":0}]
[null,"Grade 9",{"$f":"COUNTIF('Grade 9'!$D$3:$D$202, \"Gold\")","v":0},{"$f":"COUNTIF('Grade 9'!$D$3:$D$202, \"Silver\")","v":0},{"$f":"COUNTIF('Grade 9'!$D$3:$D$202, \"Bronze\")","v":0},{"$f":"COUNTIF('Grade 9'!$D$3:$D$202, \"Participation\")","v":0},{"$f":"SUM(C10:F10)","v":0},null,null,null,null,null,null,"Step 1"]
[null,"Total",{"$f":"SUM(C8:C10)","v":0},{"$f":"SUM(D8:D10)","v":0},{"$f":"SUM(E8:E10)","v":0},{"$f":"SUM(F8:F10)","v":0},{"$f":"SUM(G8:G10)","v":0}]
[null,null,null,null,null,null,null,null,null,null,null,null,null,"Step 2"]
[null,null,"You can capture."]
[null,null,"These are fixed formulas and will not change."]
[]
[null,null,null,null,null,null,null,null,null,null,null,null,null,"Step 3"]

{"sheet":"Tables","index":1,"n_rows":3,"n_cols":6,"rows_kept":3,"cut":false,"hidden":true,"merged":[]}
[]
[null,null,"Gold","Silver","Bronze","Participation"]
[null,"Grade 4 - Grade 11",40,39,34,24]

{"sheet":"Grade 7","index":2,"n_rows":202,"n_cols":5,"rows_kept":202,"cut":false,"hidden":false,"merged":[]}
[]
["No.","Full Name","Actual Mark","Category","Grade"]
[1,null,null,{"$f":"IF(C3=\"\",\"\",IF(C3<=Participation1,\"Participation\", IF(C3<=Bronze1, \"Bronze\", IF(C3<=Silver1, \"Silver\", \"Gold\"))))","v":""},{"$f":"IF(C3=\"\",\"\",7)","v":""}]
[2,null,null,"",{"$f":"IF(C4=\"\",\"\",7)","v":""}]
[3,null,null,"",""]
[4,null,null,"",""]
[5,null,null,"",""]
[6,null,null,"",""]
[7,null,null,"",""]
[8,null,null,"",""]
[9,null,null,"",""]
[10,null,null,"",""]
[11,null,null,"",""]
[12,null,null,"",""]
[13,null,null,"",""]
[14,null,null,"",""]
[15,null,null,"",""]
[16,null,null,"",""]
[17,null,null,"",""]
[18,null,null,"",""]
[19,null,null,"",""]
[20,null,null,"",""]
[21,null,null,"",""]
[22,null,null,"",""]
[23,null,null,"",""]
[24,null,null,"",""]
[25,null,null,"",""]
[26,null,null,"",""]
[27,null,null,"",""]
[28,null,null,"",""]
[29,null,null,"",""]
[30,null,null,"",""]
[31,null,null,"",""]
[32,null,null,"",""]
[33,null,null,"",""]
[34,null,null,"",""]
[35,null,null,"",""]
[36,null,null,"",""]
[37,null,null,"",""]
[38,null,null,"",""]
[39,null,null,"",""]
[40,null,null,"",""]
[41,null,null,"",""]
[42,null,null,"",""]
[43,null,null,"",""]
[44,null,null,"",""]
[45,null,null,"",""]
[46,null,null,"",""]
[47,null,null,"",""]
[48,null,null,"",""]
[49,null,null,"",""]
[50,null,null,"",""]
[51,null,null,"",""]
[52,null,null,"",""]
[53,null,null,"",""]
[54,null,null,"",""]
[55,null,null,"",""]
[56,null,null,"",""]
[57,null,null,"",""]
[58,null,null,"",""]
[59,null,null,"",""]
[60,null,null,"",""]
[61,null,null,"",""]
[62,null,null,"",""]
[63,null,null,"",""]
[64,null,null,"",""]
[65,null,null,{"$f":"IF(C67=\"\",\"\",IF(C67<=Participation1,\"Participation\", IF(C67<=Bronze1, \"Bronze\", IF(C67<=Silver1, \"Silver\", \"Gold\"))))","v":""},""]
[66,null,null,"",{"$f":"IF(C68=\"\",\"\",7)","v":""}]
[67,null,null,"",""]
[68,null,null,"",""]
[69,null,null,"",""]
[70,null,null,"",""]
[71,null,null,"",""]
[72,null,null,"",""]
[73,null,null,"",""]
[74,null,null,"",""]
[75,null,null,"",""]
[76,null,null,"",""]
[77,null,null,"",""]
[78,null,null,"",""]
[79,null,null,"",""]
[80,null,null,"",""]
[81,null,null,"",""]
[82,null,null,"",""]
[83,null,null,"",""]
[84,null,null,"",""]
[85,null,null,"",""]
[86,null,null,"",""]
[87,null,null,"",""]
[88,null,null,"",""]
[89,null,null,"",""]
[90,null,null,"",""]
[91,null,null,"",""]
[92,null,null,"",""]
[93,null,null,"",""]
[94,null,null,"",""]
[95,null,null,"",""]
[96,null,null,"",""]
[97,null,null,"",""]
[98,null,null,"",""]
[99,null,null,"",""]
[100,null,null,"",""]
[101,null,null,"",""]
[102,null,null,"",""]
[103,null,null,"",""]
[104,null,null,"",""]
[105,null,null,"",""]
[106,null,null,"",""]
[107,null,null,"",""]
[108,null,null,"",""]
[109,null,null,"",""]
[110,null,null,"",""]
[111,null,null,"",""]
[112,null,null,"",""]
[113,null,null,"",""]
[114,null,null,"",""]
[115,null,null,"",""]
[116,null,null,"",""]
[117,null,null,"",""]
[118,null,null,"",""]
[119,null,null,"",""]
[120,null,null,"",""]
[121,null,null,"",""]
[122,null,null,"",""]
[123,null,null,"",""]
[124,null,null,"",""]
[125,null,null,"",""]
[126,null,null,"",""]
[127,null,null,"",""]
[128,null,null,"",""]
[129,null,null,{"$f":"IF(C131=\"\",\"\",IF(C131<=Participation1,\"Participation\", IF(C131<=Bronze1, \"Bronze\", IF(C131<=Silver1, \"Silver\", \"Gold\"))))","v":""},""]
[130,null,null,"",{"$f":"IF(C132=\"\",\"\",7)","v":""}]
[131,null,null,"",""]
[132,null,null,"",""]
[133,null,null,"",""]
[134,null,null,"",""]
[135,null,null,"",""]
[136,null,null,"",""]
[137,null,null,"",""]
[138,null,null,"",""]
[139,null,null,"",""]
[140,null,null,"",""]
[141,null,null,"",""]
[142,null,null,"",""]
[143,null,null,"",""]
[144,null,null,"",""]
[145,null,null,"",""]
[146,null,null,"",""]
[147,null,null,"",""]
[148,null,null,"",""]
[149,null,null,"",""]
[150,null,null,"",""]
[151,null,null,"",""]
[152,null,null,"",""]
[153,null,null,"",""]
[154,null,null,"",""]
[155,null,null,"",""]
[156,null,null,"",""]
[157,null,null,"",""]
[158,null,null,"",""]
[159,null,null,"",""]
[160,null,null,"",""]
[161,null,null,"",""]
[162,null,null,"",""]
[163,null,null,"",""]
[164,null,null,"",""]
[165,null,null,"",""]
[166,null,null,"",""]
[167,null,null,"",""]
[168,null,null,"",""]
[169,null,null,"",""]
[170,null,null,"",""]
[171,null,null,"",""]
[172,null,null,"",""]
[173,null,null,"",""]
[174,null,null,"",""]
[175,null,null,"",""]
[176,null,null,"",""]
[177,null,null,"",""]
[178,null,null,"",""]
[179,null,null,"",""]
[180,null,null,"",""]
[181,null,null,"",""]
[182,null,null,"",""]
[183,null,null,"",""]
[184,null,null,"",""]
[185,null,null,"",""]
[186,null,null,"",""]
[187,null,null,"",""]
[188,null,null,"",""]
[189,null,null,"",""]
[190,null,null,"",""]
[191,null,null,"",""]
[192,null,null,"",""]
[193,null,null,{"$f":"IF(C195=\"\",\"\",IF(C195<=Participation1,\"Participation\", IF(C195<=Bronze1, \"Bronze\", IF(C195<=Silver1, \"Silver\", \"Gold\"))))","v":""},""]
[194,null,null,"",{"$f":"IF(C196=\"\",\"\",7)","v":""}]
[195,null,null,"",""]
[196,null,null,"",""]
[197,null,null,"",""]
[198,null,null,"",""]
[199,null,null,"",""]
[200,null,null,"",""]

{"sheet":"Grade 8","index":3,"n_rows":202,"n_cols":5,"rows_kept":202,"cut":false,"hidden":false,"merged":[]}
[]
["No.","Full Name","Actual Mark","Category","Grade"]
[1,null,null,{"$f":"IF(C3=\"\",\"\",IF(C3<=Participation1,\"Participation\", IF(C3<=Bronze1, \"Bronze\", IF(C3<=Silver1, \"Silver\", \"Gold\"))))","v":""},{"$f":"IF(C3=\"\",\"\",8)","v":""}]
[2,null,null,"",{"$f":"IF(C4=\"\",\"\",8)","v":""}]
[3,null,null,"",""]
[4,null,null,"",""]
[5,null,null,"",""]
[6,null,null,"",""]
[7,null,null,"",""]
[8,null,null,"",""]
[9,null,null,"",""]
[10,null,null,"",""]
[11,null,null,"",""]
[12,null,null,"",""]
[13,null,null,"",""]
[14,null,null,"",""]
[15,null,null,"",""]
[16,null,null,"",""]
[17,null,null,"",""]
[18,null,null,"",""]
[19,null,null,"",""]
[20,null,null,"",""]
[21,null,null,"",""]
[22,null,null,"",""]
[23,null,null,"",""]
[24,null,null,"",""]
[25,null,null,"",""]
[26,null,null,"",""]
[27,null,null,"",""]
[28,null,null,"",""]
[29,null,null,"",""]
[30,null,null,"",""]
[31,null,null,"",""]
[32,null,null,"",""]
[33,null,null,"",""]
[34,null,null,"",""]
[35,null,null,"",""]
[36,null,null,"",""]
[37,null,null,"",""]
[38,null,null,"",""]
[39,null,null,"",""]
[40,null,null,"",""]
[41,null,null,"",""]
[42,null,null,"",""]
[43,null,null,"",""]
[44,null,null,"",""]
[45,null,null,"",""]
[46,null,null,"",""]
[47,null,null,"",""]
[48,null,null,"",""]
[49,null,null,"",""]
[50,null,null,"",""]
[51,null,null,"",""]
[52,null,null,"",""]
[53,null,null,"",""]
[54,null,null,"",""]
[55,null,null,"",""]
[56,null,null,"",""]
[57,null,null,"",""]
[58,null,null,"",""]
[59,null,null,"",""]
[60,null,null,"",""]
[61,null,null,"",""]
[62,null,null,"",""]
[63,null,null,"",""]
[64,null,null,"",""]
[65,null,null,{"$f":"IF(C67=\"\",\"\",IF(C67<=Participation1,\"Participation\", IF(C67<=Bronze1, \"Bronze\", IF(C67<=Silver1, \"Silver\", \"Gold\"))))","v":""},""]
[66,null,null,"",{"$f":"IF(C68=\"\",\"\",8)","v":""}]
[67,null,null,"",""]
[68,null,null,"",""]
[69,null,null,"",""]
[70,null,null,"",""]
[71,null,null,"",""]
[72,null,null,"",""]
[73,null,null,"",""]
[74,null,null,"",""]
[75,null,null,"",""]
[76,null,null,"",""]
[77,null,null,"",""]
[78,null,null,"",""]
[79,null,null,"",""]
[80,null,null,"",""]
[81,null,null,"",""]
[82,null,null,"",""]
[83,null,null,"",""]
[84,null,null,"",""]
[85,null,null,"",""]
[86,null,null,"",""]
[87,null,null,"",""]
[88,null,null,"",""]
[89,null,null,"",""]
[90,null,null,"",""]
[91,null,null,"",""]
[92,null,null,"",""]
[93,null,null,"",""]
[94,null,null,"",""]
[95,null,null,"",""]
[96,null,null,"",""]
[97,null,null,"",""]
[98,null,null,"",""]
[99,null,null,"",""]
[100,null,null,"",""]
[101,null,null,"",""]
[102,null,null,"",""]
[103,null,null,"",""]
[104,null,null,"",""]
[105,null,null,"",""]
[106,null,null,"",""]
[107,null,null,"",""]
[108,null,null,"",""]
[109,null,null,"",""]
[110,null,null,"",""]
[111,null,null,"",""]
[112,null,null,"",""]
[113,null,null,"",""]
[114,null,null,"",""]
[115,null,null,"",""]
[116,null,null,"",""]
[117,null,null,"",""]
[118,null,null,"",""]
[119,null,null,"",""]
[120,null,null,"",""]
[121,null,null,"",""]
[122,null,null,"",""]
[123,null,null,"",""]
[124,null,null,"",""]
[125,null,null,"",""]
[126,null,null,"",""]
[127,null,null,"",""]
[128,null,null,"",""]
[129,null,null,{"$f":"IF(C131=\"\",\"\",IF(C131<=Participation1,\"Participation\", IF(C131<=Bronze1, \"Bronze\", IF(C131<=Silver1, \"Silver\", \"Gold\"))))","v":""},""]
[130,null,null,"",{"$f":"IF(C132=\"\",\"\",8)","v":""}]
[131,null,null,"",""]
[132,null,null,"",""]
[133,null,null,"",""]
[134,null,null,"",""]
[135,null,null,"",""]
[136,null,null,"",""]
[137,null,null,"",""]
[138,null,null,"",""]
[139,null,null,"",""]
[140,null,null,"",""]
[141,null,null,"",""]
[142,null,null,"",""]
[143,null,null,"",""]
[144,null,null,"",""]
[145,null,null,"",""]
[146,null,null,"",""]
[147,null,null,"",""]
[148,null,null,"",""]
[149,null,null,"",""]
[150,null,null,"",""]
[151,null,null,"",""]
[152,null,null,"",""]
[153,null,null,"",""]
[154,null,null,"",""]
[155,null,null,"",""]
[156,null,null,"",""]
[157,null,null,"",""]
[158,null,null,"",""]
[159,null,null,"",""]
[160,null,null,"",""]
[161,null,null,"",""]
[162,null,null,"",""]
[163,null,null,"",""]
[164,null,null,"",""]
[165,null,null,"",""]
[166,null,null,"",""]
[167,null,null,"",""]
[168,null,null,"",""]
[169,null,null,"",""]
[170,null,null,"",""]
[171,null,null,"",""]
[172,null,null,"",""]
[173,null,null,"",""]
[174,null,null,"",""]
[175,null,null,"",""]
[176,null,null,"",""]
[177,null,null,"",""]
[178,null,null,"",""]
[179,null,null,"",""]
[180,null,null,"",""]
[181,null,null,"",""]
[182,null,null,"",""]
[183,null,null,"",""]
[184,null,null,"",""]
[185,null,null,"",""]
[186,null,null,"",""]
[187,null,null,"",""]
[188,null,null,"",""]
[189,null,null,"",""]
[190,null,null,"",""]
[191,null,null,"",""]
[192,null,null,"",""]
[193,null,null,{"$f":"IF(C195=\"\",\"\",IF(C195<=Participation1,\"Participation\", IF(C195<=Bronze1, \"Bronze\", IF(C195<=Silver1, \"Silver\", \"Gold\"))))","v":""},""]
[194,null,null,"",{"$f":"IF(C196=\"\",\"\",8)","v":""}]
[195,null,null,"",""]
[196,null,null,"",""]
[197,null,null,"",""]
[198,null,null,"",""]
[199,null,null,"",""]
[200,null,null,"",""]

{"sheet":"Grade 9","index":4,"n_rows":202,"n_cols":5,"rows_kept":202,"cut":false,"hidden":false,"merged":[]}
[]
["No.","Full Name","Actual Mark","Category","Grade"]
[1,null,null,{"$f":"IF(C3=\"\",\"\",IF(C3<=Participation1,\"Participation\", IF(C3<=Bronze1, \"Bronze\", IF(C3<=Silver1, \"Silver\", \"Gold\"))))","v":""},{"$f":"IF(C3=\"\",\"\",9)","v":""}]
[2,null,null,"",{"$f":"IF(C4=\"\",\"\",9)","v":""}]
[3,null,null,"",""]
[4,null,null,"",""]
[5,null,null,"",""]
[6,null,null,"",""]
[7,null,null,"",""]
[8,null,null,"",""]
[9,null,null,"",""]
[10,null,null,"",""]
[11,null,null,"",""]
[12,null,null,"",""]
[13,null,null,"",""]
[14,null,null,"",""]
[15,null,null,"",""]
[16,null,null,"",""]
[17,null,null,"",""]
[18,null,null,"",""]
[19,null,null,"",""]
[20,null,null,"",""]
[21,null,null,"",""]
[22,null,null,"",""]
[23,null,null,"",""]
[24,null,null,"",""]
[25,null,null,"",""]
[26,null,null,"",""]
[27,null,null,"",""]
[28,null,null,"",""]
[29,null,null,"",""]
[30,null,null,"",""]
[31,null,null,"",""]
[32,null,null,"",""]
[33,null,null,{"$f":"IF(C35=\"\",\"\",IF(C35<=Participation1,\"Participation\", IF(C35<=Bronze1, \"Bronze\", IF(C35<=Silver1, \"Silver\", \"Gold\"))))","v":""},""]
[34,null,null,"",""]
[35,null,null,"",""]
[36,null,null,"",""]
[37,null,null,"",""]
[38,null,null,"",""]
[39,null,null,"",""]
[40,null,null,"",""]
[41,null,null,"",""]
[42,null,null,"",""]
[43,null,null,"",""]
[44,null,null,"",""]
[45,null,null,"",""]
[46,null,null,"",""]
[47,null,null,"",""]
[48,null,null,"",""]
[49,null,null,"",""]
[50,null,null,"",""]
[51,null,null,"",""]
[52,null,null,"",""]
[53,null,null,"",""]
[54,null,null,"",""]
[55,null,null,"",""]
[56,null,null,"",""]
[57,null,null,"",""]
[58,null,null,"",""]
[59,null,null,"",""]
[60,null,null,"",""]
[61,null,null,"",""]
[62,null,null,"",""]
[63,null,null,"",""]
[64,null,null,"",""]
[65,null,null,{"$f":"IF(C67=\"\",\"\",IF(C67<=Participation1,\"Participation\", IF(C67<=Bronze1, \"Bronze\", IF(C67<=Silver1, \"Silver\", \"Gold\"))))","v":""},""]
[66,null,null,"",{"$f":"IF(C68=\"\",\"\",9)","v":""}]
[67,null,null,"",""]
[68,null,null,"",""]
[69,null,null,"",""]
[70,null,null,"",""]
[71,null,null,"",""]
[72,null,null,"",""]
[73,null,null,"",""]
[74,null,null,"",""]
[75,null,null,"",""]
[76,null,null,"",""]
[77,null,null,"",""]
[78,null,null,"",""]
[79,null,null,"",""]
[80,null,null,"",""]
[81,null,null,"",""]
[82,null,null,"",""]
[83,null,null,"",""]
[84,null,null,"",""]
[85,null,null,"",""]
[86,null,null,"",""]
[87,null,null,"",""]
[88,null,null,"",""]
[89,null,null,"",""]
[90,null,null,"",""]
[91,null,null,"",""]
[92,null,null,"",""]
[93,null,null,"",""]
[94,null,null,"",""]
[95,null,null,"",""]
[96,null,null,"",""]
[97,null,null,{"$f":"IF(C99=\"\",\"\",IF(C99<=Participation1,\"Participation\", IF(C99<=Bronze1, \"Bronze\", IF(C99<=Silver1, \"Silver\", \"Gold\"))))","v":""},""]
[98,null,null,"",""]
[99,null,null,"",""]
[100,null,null,"",""]
[101,null,null,"",""]
[102,null,null,"",""]
[103,null,null,"",""]
[104,null,null,"",""]
[105,null,null,"",""]
[106,null,null,"",""]
[107,null,null,"",""]
[108,null,null,"",""]
[109,null,null,"",""]
[110,null,null,"",""]
[111,null,null,"",""]
[112,null,null,"",""]
[113,null,null,"",""]
[114,null,null,"",""]
[115,null,null,"",""]
[116,null,null,"",""]
[117,null,null,"",""]
[118,null,null,"",""]
[119,null,null,"",""]
[120,null,null,"",""]
[121,null,null,"",""]
[122,null,null,"",""]
[123,null,null,"",""]
[124,null,null,"",""]
[125,null,null,"",""]
[126,null,null,"",""]
[127,null,null,"",""]
[128,null,null,"",""]
[129,null,null,{"$f":"IF(C131=\"\",\"\",IF(C131<=Participation1,\"Participation\", IF(C131<=Bronze1, \"Bronze\", IF(C131<=Silver1, \"Silver\", \"Gold\"))))","v":""},""]
[130,null,null,"",{"$f":"IF(C132=\"\",\"\",9)","v":""}]
[131,null,null,"",""]
[132,null,null,"",""]
[133,null,null,"",""]
[134,null,null,"",""]
[135,null,null,"",""]
[136,null,null,"",""]
[137,null,null,"",""]
[138,null,null,"",""]
[139,null,null,"",""]
[140,null,null,"",""]
[141,null,null,"",""]
[142,null,null,"",""]
[143,null,null,"",""]
[144,null,null,"",""]
[145,null,null,"",""]
[146,null,null,"",""]
[147,null,null,"",""]
[148,null,null,"",""]
[149,null,null,"",""]
[150,null,null,"",""]
[151,null,null,"",""]
[152,null,null,"",""]
[153,null,null,"",""]
[154,null,null,"",""]
[155,null,null,"",""]
[156,null,null,"",""]
[157,null,null,"",""]
[158,null,null,"",""]
[159,null,null,"",""]
[160,null,null,"",""]
[161,null,null,{"$f":"IF(C163=\"\",\"\",IF(C163<=Participation1,\"Participation\", IF(C163<=Bronze1, \"Bronze\", IF(C163<=Silver1, \"Silver\", \"Gold\"))))","v":""},""]
[162,null,null,"",""]
[163,null,null,"",""]
[164,null,null,"",""]
[165,null,null,"",""]
[166,null,null,"",""]
[167,null,null,"",""]
[168,null,null,"",""]
[169,null,null,"",""]
[170,null,null,"",""]
[171,null,null,"",""]
[172,null,null,"",""]
[173,null,null,"",""]
[174,null,null,"",""]
[175,null,null,"",""]
[176,null,null,"",""]
[177,null,null,"",""]
[178,null,null,"",""]
[179,null,null,"",""]
[180,null,null,"",""]
[181,null,null,"",""]
[182,null,null,"",""]
[183,null,null,"",""]
[184,null,null,"",""]
[185,null,null,"",""]
[186,null,null,"",""]
[187,null,null,"",""]
[188,null,null,"",""]
[189,null,null,"",""]
[190,null,null,"",""]
[191,null,null,"",""]
[192,null,null,"",""]
[193,null,null,{"$f":"IF(C195=\"\",\"\",IF(C195<=Participation1,\"Participation\", IF(C195<=Bronze1, \"Bronze\", IF(C195<=Silver1, \"Silver\", \"Gold\"))))","v":""},""]
[194,null,null,"",{"$f":"IF(C196=\"\",\"\",9)","v":""}]
[195,null,null,"",""]
[196,null,null,"",""]
[197,null,null,"",""]
[198,null,null,"",""]
[199,null,null,"",""]
[200,null,null,"",""]